Target
Epidermal growth factor receptor [T790M,L858R]
Ligand
BDBM50379214
Substrate
Meas. Tech.
Kinase Assay
pH
7.5±n/a
Temperature
303.15±n/a K
IC50
1780±n/a nM
Comments
extracted
Citation
 Burnet, MWThaher, BAEhlert, JKubbutat, MSchaechtele, CTotzke, F Kinase modulators for the treatment of cancer US Patent  US9416123 Publication Date 8/16/2016 
Target
Name:
Epidermal growth factor receptor [T790M,L858R]
Synonyms:
EGFR EGFR_HUMAN ERBB1 Epidermal growth factor receptor (EGFR)(T790M/L858R) Epidermal growth factor receptor (T790M, L858R) Epidermal growth factor receptor(L858R, T790M) | HER1
Type:
Mol. Mass.:
134353.72
Organism:
Homo sapiens (Human)
Description:
P00533[T790M,L858R]
Residue:
1210
  
Inhibitor
Name:
BDBM50379214
Synonyms:
CHEMBL2011291 | US9416123, 6
Type:
Small organic molecule
Emp. Form.:
C20H12Cl3FN4
Mol. Mass.:
433.693
SMILES:
Nc1c(c(nn1-c1c(Cl)cc(Cl)cc1Cl)-c1ccncc1)-c1ccc(F)cc1
: