Target
Genome polyprotein [1973-2420]
Ligand
BDBM241837
Substrate
Meas. Tech.
Luciferase Assay
EC50
0.206±n/a nM
Citation
 Zhang, JZhang, YXie, HRen, QHu, BFu, CWu, XLi, SWang, CZhang, Z Spiro ring compound as hepatitis C virus (HCV) inhibitor and uses thereof US Patent  US9416139 Publication Date 8/16/2016 
Target
Name:
Genome polyprotein [1973-2420]
Synonyms:
Non-structural protein 5A (NS5A) | POLG_HCV1
Type:
Enzyme
Mol. Mass.:
48946.19
Organism:
Hepatitis C virus genotype 1a (HCV)
Description:
aa 1973-2420
Residue:
448
  
Inhibitor
Name:
BDBM241837
Synonyms:
US9416139, 15
Type:
Small organic molecule
Emp. Form.:
C58H70N8O7
Mol. Mass.:
991.2258
SMILES:
COC(=O)N[C@@H](C1CCCCC1)C(=O)N1CCC[C@H]1c1ncc([nH]1)-c1ccc(cc1)-c1ccc(c2CC3(CCCC3)Cc12)-c1ccc2nc([nH]c(=O)c2c1)[C@@H]1CCCN1C(=O)[C@@H](NC(=O)OC)C1CCCCC1
: