Target
Genome polyprotein [1973-2420]
Ligand
BDBM241846
Substrate
Meas. Tech.
Luciferase Assay
EC50
0.475±n/a nM
Citation
 Zhang, JZhang, YXie, HRen, QHu, BFu, CWu, XLi, SWang, CZhang, Z Spiro ring compound as hepatitis C virus (HCV) inhibitor and uses thereof US Patent  US9416139 Publication Date 8/16/2016 
Target
Name:
Genome polyprotein [1973-2420]
Synonyms:
Non-structural protein 5A (NS5A) | POLG_HCV1
Type:
Enzyme
Mol. Mass.:
48946.19
Organism:
Hepatitis C virus genotype 1a (HCV)
Description:
aa 1973-2420
Residue:
448
  
Inhibitor
Name:
BDBM241846
Synonyms:
US9416139, 24
Type:
Small organic molecule
Emp. Form.:
C54H64N8O9
Mol. Mass.:
969.1342
SMILES:
COC(=O)N[C@@H](C(C)C)C(=O)N1CCC[C@H]1c1nc2ccc(cc2c(=O)[nH]1)-c1ccc(c2CC3(CCCC3)Cc12)-c1ccc(cc1)-c1cnc([nH]1)[C@@H]1CC2(CN1C(=O)[C@@H](NC(=O)OC)C(C)C)OCCO2
: