Target
Genome polyprotein [1973-2419]
Ligand
BDBM241826
Substrate
Meas. Tech.
Luciferase Assay
EC50
0.016±n/a nM
Citation
 Zhang, JZhang, YXie, HRen, QHu, BFu, CWu, XLi, SWang, CZhang, Z Spiro ring compound as hepatitis C virus (HCV) inhibitor and uses thereof US Patent  US9416139 Publication Date 8/16/2016 
Target
Name:
Genome polyprotein [1973-2419]
Synonyms:
Non-structural protein 5A (NS5A) RNA-directed RNA polymerase (NS5B)
Type:
Enzyme Catalytic Domain
Mol. Mass.:
48705.67
Organism:
Hepatitis C virus genotype 1b (isolate Con1) (HCV)
Description:
Q9WMX2[1973-2419]
Residue:
447
  
Inhibitor
Name:
BDBM241826
Synonyms:
US9416139, 4
Type:
Small organic molecule
Emp. Form.:
C54H66N8O7
Mol. Mass.:
939.1512
SMILES:
COC(=O)N[C@@H](C(C)C)C(=O)N1CCC[C@H]1c1ncc([nH]1)-c1ccc(cc1)-c1ccc(c2CC3(CCCC3)Cc12)-c1ccc2c(c1)N=C(NC21COC1)[C@@H]1CCCN1C(=O)[C@@H](NC(=O)OC)C(C)C
: