Target
Genome polyprotein [2420-3010]
Ligand
BDBM241891
Substrate
Meas. Tech.
Polymerase Inhibition Assay
pH
7.3±n/a
Temperature
298.15±n/a K
EC50
18000±n/a nM
Comments
extracted
Citation
 Verma, VAArasappan, ANjoroge, FGGirijavallabhan, VBogen, SLDang, QOlsen, DB 5′-substituted nucleoside derivatives and methods of use thereof for the treatment of viral diseases US Patent  US9416154 Publication Date 8/16/2016 
Target
Name:
Genome polyprotein [2420-3010]
Synonyms:
POLG_HCVBK | RNA-directed RNA polymerase (NS5B)
Type:
Enzyme
Mol. Mass.:
65648.71
Organism:
Hepatitis C virus genotype 1b (isolate BK) (HCV)
Description:
aa 2420-3010
Residue:
591
  
Inhibitor
Name:
BDBM241891
Synonyms:
US9416154, 41
Type:
Small organic molecule
Emp. Form.:
C27H38N5O8P
Mol. Mass.:
591.5931
SMILES:
C[C@H](NP(=O)(OC(C)[C@H]1O[C@@H](n2ccc3c(N)ncnc23)[C@](C)(O)[C@@H]1O)Oc1ccccc1)C(=O)OCC(C)(C)C
: