Target
Genome polyprotein [1027-1207,A156S]
Ligand
BDBM241943
Substrate
Meas. Tech.
FRET Assay
pH
7.5±n/a
IC50
412±n/a nM
Comments
extracted
Citation
 Niu, DPetter, RCQiao, LSingh, J HCV protease inhibitors and uses thereof US Patent  US9422333 Publication Date 8/23/2016 
Target
Name:
Genome polyprotein [1027-1207,A156S]
Synonyms:
POLG_HCV1 | Protease NS3/Non-structural protein 4A (NS3/NS4A) (A156S)
Type:
Enzyme
Mol. Mass.:
19137.30
Organism:
Hepatitis C virus genotype 1b (isolate Con1) (HCV)
Description:
P26664[1027-1207,A156S]
Residue:
181
  
Inhibitor
Name:
BDBM241943
Synonyms:
US9422333, I-23
Type:
Small organic molecule
Emp. Form.:
C38H51F3N8O8
Mol. Mass.:
804.8555
SMILES:
CCC[C@H](NC(=O)[C@@H]1[C@H]2CCC[C@H]2CN1C(=O)[C@H](CNC(=O)C=C)NC(=O)[C@@H](NC(=O)c1cnccn1)C1CCCCC1)C(OC(=O)C(F)(F)F)C(=O)NC1CC1
: