Target
P2X purinoceptor 7
Ligand
BDBM242031
Substrate
Meas. Tech.
Fluorescent Imaging Plate Reader (FLIPR) Assay
pH
7.4±n/a
Temperature
310.15±n/a K
IC50
0.33±n/a nM
Comments
extracted
Citation
 Kilburn, JPRasmussen, LKJessing, MEldemenky, EMChen, BJiang, Y Cyclic amines US Patent  US9415055 Publication Date 8/16/2016 
Target
Name:
P2X purinoceptor 7
Synonyms:
ATP receptor P2RX7_HUMAN P2X purinoceptor 7 (P2X7) P2Z receptor | Purinergic receptor
Type:
Protein
Mol. Mass.:
68602.85
Organism:
Homo sapiens (Human)
Description:
Q99572
Residue:
595
  
Inhibitor
Name:
BDBM242031
Synonyms:
US9415055, 2,3-Dichloro-N-[2-(4,4-difluoro-piperidin-1-yl)-2-(4-fluoro-phenyl)-ethyl]-benzamide | US9593105, 32
Type:
Small organic molecule
Emp. Form.:
C20H19Cl2F3N2O
Mol. Mass.:
431.279
SMILES:
Fc1ccc(cc1)C(CNC(=O)c1cccc(Cl)c1Cl)N1CCC(F)(F)CC1
: