Target
P2X purinoceptor 7
Ligand
BDBM242035
Substrate
Meas. Tech.
Fluorescent Imaging Plate Reader (FLIPR) Assay
pH
7.4±n/a
Temperature
310.15±n/a K
IC50
4.8±n/a nM
Comments
extracted
Citation
 Kilburn, JPRasmussen, LKJessing, MEldemenky, EMChen, BJiang, Y Cyclic amines US Patent  US9415055 Publication Date 8/16/2016 
Target
Name:
P2X purinoceptor 7
Synonyms:
ATP receptor P2RX7_HUMAN P2X purinoceptor 7 (P2X7) P2Z receptor | Purinergic receptor
Type:
Protein
Mol. Mass.:
68602.85
Organism:
Homo sapiens (Human)
Description:
Q99572
Residue:
595
  
Inhibitor
Name:
BDBM242035
Synonyms:
US9415055, (+)2,3-dichloro-N-[2-morpholino-2-[2-(trifluoromethyl)pyrimidin-5-yl]ethyl]benzamide
Type:
Small organic molecule
Emp. Form.:
C18H17Cl2F3N4O2
Mol. Mass.:
449.254
SMILES:
FC(F)(F)c1ncc(cn1)C(CNC(=O)c1cccc(Cl)c1Cl)N1CCOCC1
: