Target
P2X purinoceptor 7
Ligand
BDBM242042
Substrate
Meas. Tech.
Fluorescent Imaging Plate Reader (FLIPR) Assay
pH
7.4±n/a
Temperature
310.15±n/a K
IC50
4±n/a nM
Comments
extracted
Citation
 Kilburn, JPRasmussen, LKJessing, MEldemenky, EMChen, BJiang, Y Cyclic amines US Patent  US9415055 Publication Date 8/16/2016 
Target
Name:
P2X purinoceptor 7
Synonyms:
ATP receptor P2RX7_HUMAN P2X purinoceptor 7 (P2X7) P2Z receptor | Purinergic receptor
Type:
Protein
Mol. Mass.:
68602.85
Organism:
Homo sapiens (Human)
Description:
Q99572
Residue:
595
  
Inhibitor
Name:
BDBM242042
Synonyms:
US9415055, 2-chloro-N-[2-(4,4-difluoro-1-piperidyl)-2-(6-fluoro-3-pyridyl)ethyl]benzamide | US9593105, 43
Type:
Small organic molecule
Emp. Form.:
C19H19ClF3N3O
Mol. Mass.:
397.822
SMILES:
Fc1ccc(cn1)C(CNC(=O)c1ccccc1Cl)N1CCC(F)(F)CC1
: