Target
Serine/threonine-protein kinase pim-1
Ligand
BDBM50043693
Substrate
Meas. Tech.
Kinase-Glo Assay
Temperature
298.15±n/a K
IC50
45±n/a nM
Comments
extracted
Citation
 Xu, YBrenning, BGKultgen, SGLiu, XSaunders, MHo, K Substituted imidazo[1,2-b]pyridazines as protein kinase inhibitors US Patent  US9416132 Publication Date 8/16/2016 
Target
Name:
Serine/threonine-protein kinase pim-1
Synonyms:
PIM-1 Kinase PIM1_HUMAN Serine/threonine-protein kinase (PIM1) Serine/threonine-protein kinase PIM1 | Serine/threonine-protein kinase pim-1 (PIM1)
Type:
Protein
Mol. Mass.:
35681.82
Organism:
Homo sapiens (Human)
Description:
P11309
Residue:
313
  
Inhibitor
Name:
BDBM50043693
Synonyms:
CHEMBL3355541 US10392392, Example 8-67 US9416132, 8-67
Type:
Small organic molecule
Emp. Form.:
C20H22F3N5O
Mol. Mass.:
405.4168
SMILES:
CN1CCC(CNc2ccn3ncc(-c4cccc(OC(F)(F)F)c4)c3n2)CC1
: