Target
Cannabinoid receptor 1
Ligand
BDBM242434
Substrate
Meas. Tech.
Binding Assay
Temperature
303.15±n/a K
Ki
1156±n/a nM
IC50
2000±n/a nM
Comments
extracted
Citation
 Yacovan, AAlroy, IAizikovich, AMirilashvili, SGrynszpan, F Sulfonamide derivatives with therapeutic indications US Patent  US9422235 Publication Date 8/23/2016 
Target
Name:
Cannabinoid receptor 1
Synonyms:
CANN6 CB-R CNR CNR1_HUMAN Cannabinoid receptor Cannabinoid receptor 1 (brain)
Type:
G Protein-Coupled Receptor (GPCR)
Mol. Mass.:
52868.96
Organism:
Homo sapiens (Human)
Description:
P21554
Residue:
472
  
Inhibitor
Name:
BDBM242434
Synonyms:
US9422235, 7
Type:
Small organic molecule
Emp. Form.:
C17H17F3N2O2S
Mol. Mass.:
370.389
SMILES:
FC(F)(F)c1cc(Nc2ccccc2)ccc1S(=O)(=O)NCC1CC1
: