Target
Cannabinoid receptor 1
Ligand
BDBM242480
Substrate
Meas. Tech.
Binding Assay
Temperature
303.15±n/a K
Ki
239±n/a nM
IC50
497±n/a nM
Comments
extracted
Citation
 Yacovan, AAlroy, IAizikovich, AMirilashvili, SGrynszpan, F Sulfonamide derivatives with therapeutic indications US Patent  US9422235 Publication Date 8/23/2016 
Target
Name:
Cannabinoid receptor 1
Synonyms:
CANN6 CB-R CNR CNR1_HUMAN Cannabinoid receptor Cannabinoid receptor 1 (brain)
Type:
G Protein-Coupled Receptor (GPCR)
Mol. Mass.:
52868.96
Organism:
Homo sapiens (Human)
Description:
P21554
Residue:
472
  
Inhibitor
Name:
BDBM242480
Synonyms:
US9422235, 58
Type:
Small organic molecule
Emp. Form.:
C18H23F3N2O2S
Mol. Mass.:
388.448
SMILES:
FC(F)(F)c1cc(NC2CC3CCC2C3)ccc1S(=O)(=O)NCC1CC1
: