Target
Cannabinoid receptor 2
Ligand
BDBM242452
Substrate
Meas. Tech.
Binding Assay
Temperature
303.15±n/a K
Ki
98±n/a nM
IC50
221±n/a nM
Comments
extracted
Citation
 Yacovan, AAlroy, IAizikovich, AMirilashvili, SGrynszpan, F Sulfonamide derivatives with therapeutic indications US Patent  US9422235 Publication Date 8/23/2016 
Target
Name:
Cannabinoid receptor 2
Synonyms:
CANNABINOID CB2 CB2 CB2B CNR2_HUMAN Cannabinoid CB2 receptor Cannabinoid receptor 2 (CB2R) | hCB2
Type:
G Protein-Coupled Receptor (GPCR)
Mol. Mass.:
39690.94
Organism:
Homo sapiens (Human)
Description:
P34972
Residue:
360
  
Inhibitor
Name:
BDBM242452
Synonyms:
US9422235, 28
Type:
Small organic molecule
Emp. Form.:
C19H22Cl2N2O5S
Mol. Mass.:
461.359
SMILES:
COc1cc(Nc2cc(Cl)c(c(Cl)c2)S(=O)(=O)NCC2CCCO2)cc(OC)c1
: