Target
Cannabinoid receptor 2
Ligand
BDBM242487
Substrate
Meas. Tech.
Binding Assay
Temperature
303.15±n/a K
Ki
3493±n/a nM
IC50
6404±n/a nM
Comments
extracted
Citation
 Yacovan, AAlroy, IAizikovich, AMirilashvili, SGrynszpan, F Sulfonamide derivatives with therapeutic indications US Patent  US9422235 Publication Date 8/23/2016 
Target
Name:
Cannabinoid receptor 2
Synonyms:
CANNABINOID CB2 CB2 CB2B CNR2_HUMAN Cannabinoid CB2 receptor Cannabinoid receptor 2 (CB2R) | hCB2
Type:
G Protein-Coupled Receptor (GPCR)
Mol. Mass.:
39690.94
Organism:
Homo sapiens (Human)
Description:
P34972
Residue:
360
  
Inhibitor
Name:
BDBM242487
Synonyms:
US9422235, 68
Type:
Small organic molecule
Emp. Form.:
C18H15Cl2F3N2O4S
Mol. Mass.:
483.289
SMILES:
COC(=O)C1(CC1)NS(=O)(=O)c1ccc(Nc2ccc(Cl)cc2Cl)cc1C(F)(F)F
: