Target
Cannabinoid receptor 2
Ligand
BDBM242523
Substrate
Meas. Tech.
Binding Assay
Temperature
303.15±n/a K
Ki
58±n/a nM
IC50
95±n/a nM
Comments
extracted
Citation
 Yacovan, AAlroy, IAizikovich, AMirilashvili, SGrynszpan, F Sulfonamide derivatives with therapeutic indications US Patent  US9422235 Publication Date 8/23/2016 
Target
Name:
Cannabinoid receptor 2
Synonyms:
CANNABINOID CB2 CB2 CB2B CNR2_HUMAN Cannabinoid CB2 receptor Cannabinoid receptor 2 (CB2R) | hCB2
Type:
G Protein-Coupled Receptor (GPCR)
Mol. Mass.:
39690.94
Organism:
Homo sapiens (Human)
Description:
P34972
Residue:
360
  
Inhibitor
Name:
BDBM242523
Synonyms:
US9422235, 108
Type:
Small organic molecule
Emp. Form.:
C19H27F3N2O2S
Mol. Mass.:
404.49
SMILES:
CC(C)(NS(=O)(=O)c1ccc(NC2CCCCC2)cc1C(F)(F)F)C1CC1
: