Target
Egl nine homolog 1
Ligand
BDBM242531
Substrate
Meas. Tech.
Fluorescence Polarization Assay
pH
7.5±n/a
IC50
49±n/a nM
Comments
extracted
Citation
 Takayama, TShibata, TShiozawa, FKawabe, KShimizu, YHamada, MHiratate, ATakahashi, MUshiyama, FOi, TShirasaki, YMatsuda, DKoizumi, CKato, S Partially saturated nitrogen-containing heterocyclic compound US Patent  US9422240 Publication Date 8/23/2016 
Target
Name:
Egl nine homolog 1
Synonyms:
C1orf12 EGLN1_HUMAN Hypoxia-inducible factor prolyl hydroxylase 2 (HIF-PH2) Prolyl hydroxylase domain-containing protein 2 (PHD2)
Type:
Protein
Mol. Mass.:
46035.59
Organism:
Homo sapiens (Human)
Description:
Q9GZT9
Residue:
426
  
Inhibitor
Name:
BDBM242531
Synonyms:
US9422240, 1-209
Type:
Small organic molecule
Emp. Form.:
C22H22N2O6
Mol. Mass.:
410.4199
SMILES:
Cc1ccc(Oc2ccc(CN3CCC(O)=C(C(=O)NCC(O)=O)C3=O)cc2)cc1
: