Target
Beta-secretase 1
Ligand
BDBM242943
Substrate
Meas. Tech.
HTRF FRET Assay
pH
5±n/a
Temperature
303.15±n/a K
Ki
270±n/a nM
Comments
extracted
Citation
 Gilbert, EJCumming, JNStamford, AWYu, YScott, JDIserloh, U Tricyclic substituted thiadiazine dioxide compounds as BACE inhibitors, compositions and their use US Patent  US9422277 Publication Date 8/23/2016 
Target
Name:
Beta-secretase 1
Synonyms:
ASP2 Aspartyl protease 2 BACE1 Beta-secretase (BACE) Beta-secretase 1 (BACE 1) Beta-secretase 1 (BACE1) Beta-site amyloid precursor protein cleaving enzyme 1 Memapsin-2 beta-Secretase (BACE-1) | beta-Secretase (BACE1)
Type:
Protein
Mol. Mass.:
55755.10
Organism:
Homo sapiens (Human)
Description:
P56817
Residue:
501
  
Inhibitor
Name:
BDBM242943
Synonyms:
US9422277, 6
Type:
Small organic molecule
Emp. Form.:
C16H18ClN5O3S2
Mol. Mass.:
427.929
SMILES:
CN1C(=N)N[C@@](C)(CS1(=O)=O)c1sc(cc1Cl)-c1ccc([nH]1)C1=NCCO1
: