Target
Beta-secretase 2
Ligand
BDBM242944
Substrate
Meas. Tech.
Time-Resolved Endpoint Proteolysis Assay
pH
5±n/a
Temperature
303.15±n/a K
Ki
35±n/a nM
Comments
extracted
Citation
 Gilbert, EJCumming, JNStamford, AWYu, YScott, JDIserloh, U Tricyclic substituted thiadiazine dioxide compounds as BACE inhibitors, compositions and their use US Patent  US9422277 Publication Date 8/23/2016 
Target
Name:
Beta-secretase 2
Synonyms:
AEPLC ASP1 Asp 1 Aspartyl protease 1 BACE2_HUMAN Beta-secretase (BACE) Beta-secretase 2 (BACE-2) Beta-site APP-cleaving enzyme 2 Memapsin-1 beta-Secretase (BACE-2)
Type:
Protein
Mol. Mass.:
56171.20
Organism:
Homo sapiens (Human)
Description:
Q9Y5Z0
Residue:
518
  
Inhibitor
Name:
BDBM242944
Synonyms:
US9422277, 7
Type:
Small organic molecule
Emp. Form.:
C17H20ClN5O3S2
Mol. Mass.:
441.955
SMILES:
CC1CN=C(O1)c1ccc([nH]1)-c1cc(Cl)c(s1)[C@]1(C)CS(=O)(=O)N(C)C(=N)N1
: