Target
Beta-secretase 2
Ligand
BDBM243000
Substrate
Meas. Tech.
Time-Resolved Endpoint Proteolysis Assay
pH
5±n/a
Temperature
303.15±n/a K
Ki
527.3±n/a nM
Comments
extracted
Citation
 Gilbert, EJCumming, JNStamford, AWYu, YScott, JDIserloh, U Tricyclic substituted thiadiazine dioxide compounds as BACE inhibitors, compositions and their use US Patent  US9422277 Publication Date 8/23/2016 
Target
Name:
Beta-secretase 2
Synonyms:
AEPLC ASP1 Asp 1 Aspartyl protease 1 BACE2_HUMAN Beta-secretase (BACE) Beta-secretase 2 (BACE-2) Beta-site APP-cleaving enzyme 2 Memapsin-1 beta-Secretase (BACE-2)
Type:
Protein
Mol. Mass.:
56171.20
Organism:
Homo sapiens (Human)
Description:
Q9Y5Z0
Residue:
518
  
Inhibitor
Name:
BDBM243000
Synonyms:
US9422277, 63
Type:
Small organic molecule
Emp. Form.:
C24H22ClN5O4S2
Mol. Mass.:
544.046
SMILES:
CN1C(=N)N[C@@](C)(CS1(=O)=O)c1sc(cc1Cl)-c1nnc(o1)-c1ccc(OCc2ccccc2)cc1
: