Target
Bromodomain-containing protein 4 [44-168]
Ligand
BDBM242685
Substrate
Meas. Tech.
AlphaScreen Assay
IC50
1996±n/a nM
Citation
 Engelhardt, HGianni, DKessler, DReiser, USmethurst, CSteffen, A Triazolopyridazine US Patent  US9422290 Publication Date 8/23/2016 
Target
Name:
Bromodomain-containing protein 4 [44-168]
Synonyms:
BET bromodomain 4(1) (BRD4(1)) BRD4-BD1 protein (aa 44-168) Bromodomain protein 4 (BRD4-BD1) Bromodomain-containing protein 4 (BRD4) (aa 44-168) Bromodomain-containing protein 4 bromodomain 1 (BRD4-BD1) | HUNK1
Type:
Enzyme Catalytic Domain
Mol. Mass.:
14866.49
Organism:
Homo sapiens (Human)
Description:
aa (44-168)
Residue:
125
  
Inhibitor
Name:
BDBM242685
Synonyms:
US9422290, II-13
Type:
Small organic molecule
Emp. Form.:
C18H18N6S
Mol. Mass.:
350.441
SMILES:
CSc1cc(nn2c(C)nnc12)-c1cn(C)nc1Cc1ccccc1
: