Target
Thymidylate synthase
Ligand
BDBM50027656
Substrate
Meas. Tech.
Inhibition Assay
IC50
29000±n/a nM
Citation
 Gangjee, A Tricyclic compounds having cytostatic and/or cytotoxic activity and methods of use thereof US Patent  US9422297 Publication Date 8/23/2016 
Target
Name:
Thymidylate synthase
Synonyms:
TS TYMS Thymidylate synthase (TS) | Thymidylate synthase/GAR transformylase/AICAR transformylase
Type:
Enzyme
Mol. Mass.:
35718.07
Organism:
Homo sapiens (Human)
Description:
Residue:
313
  
Inhibitor
Name:
BDBM50027656
Synonyms:
CHEBI:63616 LY-231514 US9422297, Pemetrexed
Type:
Small organic molecule
Emp. Form.:
C20H21N5O6
Mol. Mass.:
427.4106
SMILES:
Nc1nc2[nH]cc(CCc3ccc(cc3)C(=O)N[C@@H](CCC(O)=O)C(O)=O)c2c(=O)[nH]1
: