Target
Thymidylate synthase
Ligand
BDBM242739
Substrate
Meas. Tech.
Inhibition Assay
IC50
60±n/a nM
Citation
 Gangjee, A Tricyclic compounds having cytostatic and/or cytotoxic activity and methods of use thereof US Patent  US9422297 Publication Date 8/23/2016 
Target
Name:
Thymidylate synthase
Synonyms:
TS TYSY_ECOLI thyA
Type:
Enzyme
Mol. Mass.:
30475.81
Organism:
Escherichia coli
Description:
Residue:
264
  
Inhibitor
Name:
BDBM242739
Synonyms:
US9422297, PDDF
Type:
Small organic molecule
Emp. Form.:
C24H23N5O6
Mol. Mass.:
477.4693
SMILES:
Nc1nc(=O)c2cc(CN(CC#C)c3ccc(cc3)C(=O)NC(CCC(O)=O)C(O)=O)ccc2[nH]1
: