Target
Epidermal growth factor receptor
Ligand
BDBM242723
Substrate
Meas. Tech.
Inhibition Assay
IC50
42600±n/a nM
Citation
 Gangjee, A Tricyclic compounds having cytostatic and/or cytotoxic activity and methods of use thereof US Patent  US9422297 Publication Date 8/23/2016 
Target
Name:
Epidermal growth factor receptor
Synonyms:
EGF Receptor Substrate EGFR_HUMAN ERBB1 Epidermal Growth Factor Receptor erbB-1 Epidermal growth factor receptor (EGFR) HER1 Proto-oncogene c-ErbB-1 Tyrosine-Protein Kinase ErbB-1
Type:
Receptor Kinase Domain
Mol. Mass.:
134279.59
Organism:
Homo sapiens (Human)
Description:
P00533
Residue:
1210
  
Inhibitor
Name:
BDBM242723
Synonyms:
US9422297, AAG145-126
Type:
Small organic molecule
Emp. Form.:
C20H20N4
Mol. Mass.:
316.3996
SMILES:
CC(C)c1ccc(Nc2nc(N)nc3Cc4ccccc4-c23)cc1
: