Target
Platelet-derived growth factor receptor beta
Ligand
BDBM50111603
Substrate
Meas. Tech.
Inhibition Assay
IC50
3750±n/a nM
Citation
 Gangjee, A Tricyclic compounds having cytostatic and/or cytotoxic activity and methods of use thereof US Patent  US9422297 Publication Date 8/23/2016 
Target
Name:
Platelet-derived growth factor receptor beta
Synonyms:
Beta-type platelet-derived growth factor receptor CD140b antigen PDGF Receptor Substrate PDGFR PDGFR-1 PDGFRB PGFRB_HUMAN Platelet-derived growth factor receptor 1 Platelet-derived growth factor receptor beta (PDGFR-beta) Platelet-derived growth factor receptor beta (PDGFRbeta) | VHL/PDGFRB
Type:
Enzyme
Mol. Mass.:
123922.25
Organism:
Homo sapiens (Human)
Description:
P09619
Residue:
1106
  
Inhibitor
Name:
BDBM50111603
Synonyms:
3-(4-(dimethylamino)benzylidene)indolin-2-one 3-[1-(4-Dimethylamino-phenyl)-meth-(E)-ylidene]-1,3-dihydro-indol-2-one SU-4312 US9422297, DMBI
Type:
Small organic molecule
Emp. Form.:
C17H16N2O
Mol. Mass.:
264.3217
SMILES:
CN(C)c1ccc(\C=C2\C(=O)Nc3ccccc23)cc1
: