Target
Vascular endothelial growth factor receptor 2
Ligand
BDBM242736
Substrate
Meas. Tech.
Inhibition Assay
IC50
5100±n/a nM
Citation
 Gangjee, A Tricyclic compounds having cytostatic and/or cytotoxic activity and methods of use thereof US Patent  US9422297 Publication Date 8/23/2016 
Target
Name:
Vascular endothelial growth factor receptor 2
Synonyms:
CD_antigen=CD309 Fetal liver kinase 1 (FLK-1) KDR Protein-tyrosine kinase receptor Flk-1 VEGFR-2 VEGFR2 Vascular Endothelial Growth Factor Receptor Kinase 2 Vascular endothelial growth factor receptor 2 (KDR) Vascular endothelial growth factor receptor 2 (VEGFR2) Vascular endothelial growth factor receptor-2 (VEGFR-2)
Type:
Receptor Tyrosine Kinase
Mol. Mass.:
151510.97
Organism:
Homo sapiens (Human)
Description:
P35968
Residue:
1356
  
Inhibitor
Name:
BDBM242736
Synonyms:
US9422297, AAG145-344
Type:
Small organic molecule
Emp. Form.:
C17H14N4
Mol. Mass.:
274.3199
SMILES:
Nc1nc-2c(Cc3ccccc-23)c(Nc2ccccc2)n1
: