Target
Neuromedin-K receptor
Ligand
BDBM50112179
Substrate
Meas. Tech.
Competitive Binding Assay
pH
7.4±n/a
Ki
60±n/a nM
Comments
extracted
Citation
 Hoveyda, HDutheuil, GFraser, G Substituted [1,2,4]triazolo[4,3-a]pyrazines as selective NK-3 receptor antagonists US Patent  US9422299 Publication Date 8/23/2016 
Target
Name:
Neuromedin-K receptor
Synonyms:
NK-3 receptor NK3R NKR Neurokinin B receptor Neuromedin-3 receptor (NK-3R) Neuromedin-K receptor Neuromedin-K receptor (NK3) TAC3R Tachykinin receptor 3 | Tachykinin receptor 3 (NK3)
Type:
Enzyme
Mol. Mass.:
52221.96
Organism:
Homo sapiens (Human)
Description:
P29371
Residue:
465
  
Inhibitor
Name:
BDBM50112179
Synonyms:
CHEMBL3608740 US10836768, Cpd no 20 US9422299, 20 | US9987274, Compound 20
Type:
Small organic molecule
Emp. Form.:
C16H16N6OS
Mol. Mass.:
340.403
SMILES:
C[C@H]1N(CCn2c1nnc2-c1nc(C)ns1)C(=O)c1ccccc1
: