Target
E3 ubiquitin-protein ligase XIAP [124-214,C202A,C213G]
Ligand
BDBM242802
Substrate
Meas. Tech.
TR-FRET Assay
pH
7.5±n/a
Temperature
310.15±n/a K
IC50
16±n/a nM
Comments
extracted
Citation
 Donnell, AFKester, RLou, YAnthony, JRemiszewski, S 2-oxo-2,3,4,5-tetrahydro-1 H-benzo[B]diazepines and their use in the treatment of cancer US Patent  US9422331 Publication Date 8/23/2016 
Target
Name:
E3 ubiquitin-protein ligase XIAP [124-214,C202A,C213G]
Synonyms:
API3 E3 ubiquitin-protein ligase XIAP (BIR2) XIAP | XIAP_HUMAN
Type:
Enzyme
Mol. Mass.:
14676.71
Organism:
Artificial Organism
Description:
P98170[124-214,C202A,C213G]
Residue:
125
  
Inhibitor
Name:
BDBM242802
Synonyms:
US9422331, 23
Type:
Small organic molecule
Emp. Form.:
C33H39N5O4
Mol. Mass.:
569.6939
SMILES:
CN[C@@H](C)C(=O)N[C@H]1[C@H](C)N(C(=O)C2CCOCC2)c2ccccc2N(Cc2c(cnc3ccccc23)C2CC2)C1=O
: