Target
E3 ubiquitin-protein ligase XIAP [241-356]
Ligand
BDBM242807
Substrate
Meas. Tech.
TR-FRET Assay
pH
7.5±n/a
Temperature
310.15±n/a K
IC50
12150±n/a nM
Comments
extracted
Citation
 Donnell, AFKester, RLou, YAnthony, JRemiszewski, S 2-oxo-2,3,4,5-tetrahydro-1 H-benzo[B]diazepines and their use in the treatment of cancer US Patent  US9422331 Publication Date 8/23/2016 
Target
Name:
E3 ubiquitin-protein ligase XIAP [241-356]
Synonyms:
API3 BIRC4 E3 ubiquitin-protein ligase XIAP BIR-3 IAP3 X-linked inhibitor of apoptosis protein BIR3 domain (XIAP BIR-3) XIAP-BIR3 baculovirus IAP repeat 3 (BIR3) domain of XIAP
Type:
Protein Binding Domain
Mol. Mass.:
13276.62
Organism:
Homo sapiens (Human)
Description:
BIR3 of XIAP: RESIDUES 241-356.
Residue:
116
  
Inhibitor
Name:
BDBM242807
Synonyms:
US9422331, 29
Type:
Small organic molecule
Emp. Form.:
C31H35N5O5S
Mol. Mass.:
589.705
SMILES:
CC[C@H](NC)C(=O)N[C@H]1[C@H](C)N(C(=O)CS(C)(=O)=O)c2cc(ccc2N(Cc2c(C)ccc3ccccc23)C1=O)C#N
: