Target
E3 ubiquitin-protein ligase XIAP [241-356]
Ligand
BDBM242813
Substrate
Meas. Tech.
TR-FRET Assay
pH
7.5±n/a
Temperature
310.15±n/a K
IC50
5524±n/a nM
Comments
extracted
Citation
 Donnell, AFKester, RLou, YAnthony, JRemiszewski, S 2-oxo-2,3,4,5-tetrahydro-1 H-benzo[B]diazepines and their use in the treatment of cancer US Patent  US9422331 Publication Date 8/23/2016 
Target
Name:
E3 ubiquitin-protein ligase XIAP [241-356]
Synonyms:
API3 BIRC4 E3 ubiquitin-protein ligase XIAP BIR-3 IAP3 X-linked inhibitor of apoptosis protein BIR3 domain (XIAP BIR-3) XIAP-BIR3 baculovirus IAP repeat 3 (BIR3) domain of XIAP
Type:
Protein Binding Domain
Mol. Mass.:
13276.62
Organism:
Homo sapiens (Human)
Description:
BIR3 of XIAP: RESIDUES 241-356.
Residue:
116
  
Inhibitor
Name:
BDBM242813
Synonyms:
US9422331, 37
Type:
Small organic molecule
Emp. Form.:
C31H33N5O4
Mol. Mass.:
539.6248
SMILES:
CN[C@@H](C)C(=O)N[C@H]1[C@H](C)N(C(C)=O)c2cc(ccc2N(Cc2cc(ccc2OC)-c2ccccc2)C1=O)C#N
: