Target
E3 ubiquitin-protein ligase XIAP [124-240]
Ligand
BDBM242835
Substrate
Meas. Tech.
TR-FRET Assay
pH
7.5±n/a
Temperature
310.15±n/a K
IC50
139±n/a nM
Comments
extracted
Citation
 Hogg, JHLe, KLou, YMischke, SGRemiszewski, S Azaheterocycles as BIR2 and/or BIR3 inhibitors US Patent  US9422332 Publication Date 8/23/2016 
Target
Name:
E3 ubiquitin-protein ligase XIAP [124-240]
Synonyms:
API3 Baculoviral IAP repeat-containing protein 2 (BIR2) E3 ubiquitin-protein ligase XIAP BIR2 XIAP XIAP_HUMAN
Type:
Protein
Mol. Mass.:
13562.46
Organism:
Artificial Sequence
Description:
TR-FRET peptide Corresponds to amino acids 124-240 of human XIAP.
Residue:
117
  
Inhibitor
Name:
BDBM242835
Synonyms:
US9422332, 18
Type:
Small organic molecule
Emp. Form.:
C24H28F2N4O3
Mol. Mass.:
458.5009
SMILES:
CN[C@@H](C)C(=O)N[C@@H](C(C)C)C(=O)N1Cc2ccccc2[C@@H]1C(=O)Nc1c(F)cccc1F
: