Target
Genome polyprotein [810-3010]
Ligand
BDBM243435
Substrate
Meas. Tech.
Stable Replicon Assay
EC50
0.012±n/a nM
Citation
 Vandyck, KLast, SJHoupis, INRaboisson, PJ Benzimidazole-imidazole derivatives US Patent  US9427428 Publication Date 8/30/2016 
Target
Name:
Genome polyprotein [810-3010]
Synonyms:
POLG_HCVCO | Serine protease NS3-NS5B
Type:
Enzyme
Mol. Mass.:
238564.18
Organism:
Hepatitis C virus genotype 1b (isolate Con1) (HCV)
Description:
aa 810-3010
Residue:
2201
  
Inhibitor
Name:
BDBM243435
Synonyms:
US9427428, 4
Type:
Small organic molecule
Emp. Form.:
C42H50N8O8
Mol. Mass.:
794.8952
SMILES:
CO[C@H](C)[C@H](NC(=O)OC)C(=O)N1CCC[C@H]1c1ncc([nH]1)-c1ccc2cc(ccc2c1)-c1ccc2nc([nH]c2c1)[C@@H]1CCCN1C(=O)[C@@H](NC(=O)OC)[C@@H](C)OC
: