Target
Genome polyprotein [1973-2419,L2000T]
Ligand
BDBM243435
Substrate
Meas. Tech.
Transient Replicon Assay
EC50
0.052±n/a nM
Citation
 Vandyck, KLast, SJHoupis, INRaboisson, PJ Benzimidazole-imidazole derivatives US Patent  US9427428 Publication Date 8/30/2016 
Target
Name:
Genome polyprotein [1973-2419,L2000T]
Synonyms:
Non-structural protein 5A (NS5A)(L28T) Serine protease NS5A (L28T)
Type:
Enzyme
Mol. Mass.:
48693.61
Organism:
Hepatitis C virus genotype 1b (isolate Con1) (HCV)
Description:
aa 1973-2419
Residue:
447
  
Inhibitor
Name:
BDBM243435
Synonyms:
US9427428, 4
Type:
Small organic molecule
Emp. Form.:
C42H50N8O8
Mol. Mass.:
794.8952
SMILES:
CO[C@H](C)[C@H](NC(=O)OC)C(=O)N1CCC[C@H]1c1ncc([nH]1)-c1ccc2cc(ccc2c1)-c1ccc2nc([nH]c2c1)[C@@H]1CCCN1C(=O)[C@@H](NC(=O)OC)[C@@H](C)OC
: