Target
Genome polyprotein [1973-2419,L2000T]
Ligand
BDBM243437
Substrate
Meas. Tech.
Transient Replicon Assay
EC50
0.041±n/a nM
Citation
 Vandyck, KLast, SJHoupis, INRaboisson, PJ Benzimidazole-imidazole derivatives US Patent  US9427428 Publication Date 8/30/2016 
Target
Name:
Genome polyprotein [1973-2419,L2000T]
Synonyms:
Non-structural protein 5A (NS5A)(L28T) Serine protease NS5A (L28T)
Type:
Enzyme
Mol. Mass.:
48693.61
Organism:
Hepatitis C virus genotype 1b (isolate Con1) (HCV)
Description:
aa 1973-2419
Residue:
447
  
Inhibitor
Name:
BDBM243437
Synonyms:
US9427428, 18
Type:
Small organic molecule
Emp. Form.:
C43H52N8O7
Mol. Mass.:
792.9224
SMILES:
CC[C@H](C)[C@H](NC(=O)OC)C(=O)N1CCC[C@H]1c1nc2ccc(cc2[nH]1)-c1ccc2cc(ccc2c1)-c1cnc([nH]1)[C@H]1CCCN1C(=O)[C@@H](NC(=O)OC)[C@@H](C)OC
: