Target
Genome polyprotein [1973-2419,Y2165H]
Ligand
BDBM243448
Substrate
Meas. Tech.
Transient Replicon Assay
EC50
0.275±n/a nM
Citation
 Vandyck, KLast, SJHoupis, INRaboisson, PJ Benzimidazole-imidazole derivatives US Patent  US9427428 Publication Date 8/30/2016 
Target
Name:
Genome polyprotein [1973-2419,Y2165H]
Synonyms:
Non-structural protein 5A (NS5A)(Y93H) Serine protease NS5A (Y93H)
Type:
Enzyme
Mol. Mass.:
48680.14
Organism:
Hepatitis C virus genotype 1b (isolate Con1) (HCV)
Description:
aa 1973-2419
Residue:
447
  
Inhibitor
Name:
BDBM243448
Synonyms:
US9427428, 12 | US9433609, 12
Type:
Small organic molecule
Emp. Form.:
C46H54N8O8
Mol. Mass.:
846.9698
SMILES:
COC(=O)NC(C1CCOCC1)C(=O)N1CCC[C@H]1c1ncc([nH]1)-c1ccc2cc(ccc2c1)-c1ccc2nc([nH]c2c1)[C@@H]1CCCN1C(=O)C(NC(=O)OC)C1CCOCC1
: