Target
Genome polyprotein [1027-3010]
Ligand
BDBM243476
Substrate
Meas. Tech.
Replicon Assay
EC50
14480±n/a nM
Citation
 Vendeville, SMRaboisson, PJLin, TTahri, AAmssoms, KI Macrocyclic indole derivatives useful as hepatitis C virus inhibitors US Patent  US9427440 Publication Date 8/30/2016 
Target
Name:
Genome polyprotein [1027-3010]
Synonyms:
POLG_HCVJ4 | Serine protease NS3/ RNA-directed RNA polymerase NS5B (NS3-NS5B)
Type:
Enzyme
Mol. Mass.:
214313.50
Organism:
Hepatitis C virus genotype 1b (strain HC-J4) (HCV)
Description:
aa 1027-3010
Residue:
1984
  
Inhibitor
Name:
BDBM243476
Synonyms:
US9427440, 24
Type:
Small organic molecule
Emp. Form.:
C31H35ClN4O4S
Mol. Mass.:
595.152
SMILES:
CN1CCCCN(C)S(=O)(=O)NC(=O)c2ccc3c(C4CCCCC4)c4-c5cc(Cl)ccc5C=C(Cn4c3c2)C1=O
: