Target
Genome polyprotein [2420-3010]
Ligand
BDBM243470
Substrate
Meas. Tech.
Primer-Dependent Transcription Assay
Temperature
298.15±n/a K
IC50
26±n/a nM
Comments
extracted
Citation
 Vendeville, SMRaboisson, PJLin, TTahri, AAmssoms, KI Macrocyclic indole derivatives useful as hepatitis C virus inhibitors US Patent  US9427440 Publication Date 8/30/2016 
Target
Name:
Genome polyprotein [2420-3010]
Synonyms:
POLG_HCVCO RNA-directed RNA polymerase (NS5B)
Type:
Enzyme
Mol. Mass.:
65783.36
Organism:
Hepatitis C virus genotype 1b (isolate Con1) (HCV)
Description:
aa 2420-3010
Residue:
591
  
Inhibitor
Name:
BDBM243470
Synonyms:
US9427440, 18
Type:
Small organic molecule
Emp. Form.:
C32H38N4O5S
Mol. Mass.:
590.733
SMILES:
COc1ccc2-c3c(C4CCCCC4)c4ccc5cc4n3CC(=Cc2c1)C(=O)N(C)CCCCN(C)S(=O)(=O)NC5=O
: