Target
Atypical chemokine receptor 3
Ligand
BDBM243513
Substrate
Meas. Tech.
In Vitro Assay
Temperature
310.15±n/a K
EC50
34±n/a nM
Comments
extracted
Citation
 Fretz, HGude, MGuerry, PKimmerlin, TLehembre, FPfeifer, TValdenaire, A 1-[m-carboxamido(hetero)aryl-methyl]-heterocyclyl-carboxamide derivatives US Patent  US9428456 Publication Date 8/30/2016 
Target
Name:
Atypical chemokine receptor 3
Synonyms:
ACKR3 C-X-C chemokine receptor type 7 CMKOR1 CXCR-7 Chemokine orphan receptor 1 G-protein coupled receptor RDC1 homolog RDC-1 | RDC1
Type:
Enzyme
Mol. Mass.:
41498.84
Organism:
Homo sapiens (Human)
Description:
P25106
Residue:
362
  
Inhibitor
Name:
BDBM243513
Synonyms:
US9428456, 1.032
Type:
Small organic molecule
Emp. Form.:
C30H41N3O2
Mol. Mass.:
475.6654
SMILES:
CC(C)(C)c1ccc(cc1)C(=O)Nc1cccc(CN2CCC(CC2)C(=O)NC2CCCCC2)c1
: