Target
Androgen receptor [W742C]
Ligand
BDBM245168
Substrate
Meas. Tech.
Transactivation Assay
Temperature
310.15±n/a K
IC50
72±n/a nM
Comments
extracted
Citation
 Nguyen, DKünzer, HFaus Gimenez, HBader, BKöhr, SFritsch, M N-[4-(quinolin-4-yloxy)cyclohexyl(methyl)](hetero)arylcarboxamides as androgen receptor antagonists, production and use thereof as medicinal products US Patent  US9428460 Publication Date 8/30/2016 
Target
Name:
Androgen receptor [W742C]
Synonyms:
ANDR_HUMAN Androgen receptor (W742C) NR3C4
Type:
Enzyme
Mol. Mass.:
99102.20
Organism:
Homo sapiens (Human)
Description:
Entry Version 159, Sequence Version 2 (P10275)
Residue:
920
  
Inhibitor
Name:
BDBM245168
Synonyms:
US9428460, 24
Type:
Small organic molecule
Emp. Form.:
C23H19F2N3O2
Mol. Mass.:
407.4127
SMILES:
Fc1ccc(cc1F)C(=O)N[C@H]1CC[C@@H](CC1)Oc1ccnc2c(cccc12)C#N
: