Target
Genome polyprotein [192-746]
Ligand
BDBM245421
Substrate
Meas. Tech.
Reporter Assay
Temperature
310.15±n/a K
EC50
2581±n/a nM
Comments
extracted
Citation
 Ding, QJiang, NWeikert, RJ Antiviral compounds US Patent  US9428469 Publication Date 8/30/2016 
Target
Name:
Genome polyprotein [192-746]
Synonyms:
Envelope glycoprotein E1 and E2 | POLG_HCVCO
Type:
Enzyme
Mol. Mass.:
61000.13
Organism:
Hepatitis C virus genotype 1b (isolate Con1) (HCV)
Description:
aa 192-746
Residue:
555
  
Inhibitor
Name:
BDBM245421
Synonyms:
US9428469, 2
Type:
Small organic molecule
Emp. Form.:
C13H11Cl2N5O
Mol. Mass.:
324.165
SMILES:
Clc1cc(Cl)cc(Nc2n[nH]c(NCc3ccco3)n2)c1
: