Target
Beta-secretase 2
Ligand
BDBM244053
Substrate
Meas. Tech.
HTRF FRET Assay
pH
5±n/a
Temperature
303.15±n/a K
Ki
3±n/a nM
Comments
extracted
Citation
 Khan, TAScott, JDCumming, JN S-imino-S-oxo-iminothiadiazine compounds as BACE inhibitors, compositions, and their use US Patent  US9428476 Publication Date 8/30/2016 
Target
Name:
Beta-secretase 2
Synonyms:
AEPLC ASP1 Asp 1 Aspartyl protease 1 BACE2_HUMAN Beta-secretase (BACE) Beta-secretase 2 (BACE-2) Beta-site APP-cleaving enzyme 2 Memapsin-1 beta-Secretase (BACE-2)
Type:
Protein
Mol. Mass.:
56171.20
Organism:
Homo sapiens (Human)
Description:
Q9Y5Z0
Residue:
518
  
Inhibitor
Name:
BDBM244053
Synonyms:
US9428476, 6
Type:
Small organic molecule
Emp. Form.:
C19H22ClFN6O2S
Mol. Mass.:
452.933
SMILES:
CCN1C(=N)N[C@@](C)(CS1(=O)=NC)c1cc(NC(=O)c2ccc(Cl)cn2)ccc1F
: