Target
Genome polyprotein [1973-2419]
Ligand
BDBM244106
Substrate
Meas. Tech.
Immumoenzymatic Assay
Temperature
310.15±n/a K
IC50
0.0031±n/a nM
Comments
extracted
Citation
 Ivachtchenko, AVBichko, VVMitkin, OD Substituted azoles, antiviral active component, pharmaceutical composition, method for preparation and use thereof US Patent  US9428491 Publication Date 8/30/2016 
Target
Name:
Genome polyprotein [1973-2419]
Synonyms:
Non-structural protein 5A (NS5A) RNA-directed RNA polymerase (NS5B)
Type:
Enzyme Catalytic Domain
Mol. Mass.:
48705.67
Organism:
Hepatitis C virus genotype 1b (isolate Con1) (HCV)
Description:
Q9WMX2[1973-2419]
Residue:
447
  
Inhibitor
Name:
BDBM244106
Synonyms:
US9428491, 1.1 US9428491, 1.1: naphtalene-1,5-disulfonic acid
Type:
Small organic molecule
Emp. Form.:
C38H46N8O6
Mol. Mass.:
710.8218
SMILES:
COC(=O)N[C@@H](C(C)C)C(=O)N1CCC[C@H]1c1nc(c[nH]1)C#CC#Cc1ccc(cc1)-c1c[nH]c(n1)[C@@H]1CCCN1C(=O)[C@@H](NC(=O)OC)C(C)C
: