Target
ALK tyrosine kinase receptor
Ligand
BDBM245255
Substrate
Meas. Tech.
ELISA-Based In Vitro Kinase Assay
pH
7.5±n/a
Temperature
303.15±n/a K
IC50
1800±n/a nM
Comments
extracted
Citation
 Gambacorti-Passerini, CMologni, LScapozza, LBisson, WAhmed, SGoekjian, PTardy, SOrsato, AGueyrard, DBenoit, J Alpha-carbolines for the treatment of cancer US Patent  US9428500 Publication Date 8/30/2016 
Target
Name:
ALK tyrosine kinase receptor
Synonyms:
ALK ALK_HUMAN CD_antigen: CD246
Type:
Protein
Mol. Mass.:
176453.10
Organism:
Homo sapiens (Human)
Description:
Q9UM73
Residue:
1620
  
Inhibitor
Name:
BDBM245255
Synonyms:
US9428500, 49
Type:
Small organic molecule
Emp. Form.:
C33H28FN5
Mol. Mass.:
513.6073
SMILES:
CN1CCN(CC1)c1ccc(cc1)-c1ccc2[nH]c3nccc(-c4ccc(nc4)-c4ccc(F)cc4)c3c2c1
: