Target
ALK tyrosine kinase receptor [L1196M]
Ligand
BDBM245227
Substrate
Meas. Tech.
ELISA-Based In Vitro Kinase Assay
pH
7.5±n/a
Temperature
303.15±n/a K
IC50
700±n/a nM
Comments
extracted
Citation
 Gambacorti-Passerini, CMologni, LScapozza, LBisson, WAhmed, SGoekjian, PTardy, SOrsato, AGueyrard, DBenoit, J Alpha-carbolines for the treatment of cancer US Patent  US9428500 Publication Date 8/30/2016 
Target
Name:
ALK tyrosine kinase receptor [L1196M]
Synonyms:
ALK ALK tyrosine kinase receptor (ALK) (L1196M) ALK tyrosine kinase receptor (L1196M) Anaplastic lymphoma kinase L1196M (ALK L1196M) | Tyrosine-protein kinase receptor [L1196M]
Type:
Mol. Mass.:
176471.13
Organism:
Homo sapiens (Human)
Description:
Q9UM73[L1196M]
Residue:
1620
  
Inhibitor
Name:
BDBM245227
Synonyms:
US9428500, 21
Type:
Small organic molecule
Emp. Form.:
C40H41N5
Mol. Mass.:
591.787
SMILES:
CN1CCC(CC1)N1CCN(CC1)c1ccc(cc1)-c1ccc2[nH]c3nccc(-c4ccc(Cc5ccccc5)cc4)c3c2c1
: