Target
Phosphatidylinositol 4,5-bisphosphate 3-kinase catalytic subunit alpha isoform
Ligand
BDBM244226
Substrate
Meas. Tech.
Inhibitory Assay
pH
7.5±n/a
IC50
1.8±n/a nM
Comments
extracted
Citation
 Ohnuki, KAzami, HSawada, YShin, TKuramoto, KKikuchi, SSaito, THamaguchi, HNagashima, T Bicyclic nitrogen-containing aromatic heterocyclic amide compound US Patent  US9428501 Publication Date 8/30/2016 
Target
Name:
Phosphatidylinositol 4,5-bisphosphate 3-kinase catalytic subunit alpha isoform
Synonyms:
P42336 PI3-kinase subunit p110-alpha PIK3CA Phosphatidylinositol 3-kinase alpha (PI3Kalpha) Phosphatidylinositol 4,5-bisphosphate 3-kinase (PI3K) Phosphatidylinositol 4,5-bisphosphate 3-kinase catalytic subunit alpha (PI3Kalpha) Phosphatidylinositol 4,5-bisphosphate 3-kinase catalytic subunit alpha isoform (PI3-Ka) Phosphatidylinositol 4,5-bisphosphate 3-kinase catalytic subunit alpha isoform (PI3K p110alpha) Phosphatidylinositol 4,5-bisphosphate 3-kinase catalytic subunit alpha isoform (PI3K-alpha) Phosphatidylinositol 4,5-bisphosphate 3-kinase catalytic subunit alpha isoform (PI3Kalpha p110alpha) Phosphatidylinositol 4,5-bisphosphate 3-kinase catalytic subunit alpha isoform (PIK3CA) Phosphatidylinositol-4,5-bisphosphate 3-kinase catalytic subunit alpha isoform Phosphoinositide 3-Kinase (PI3K), alpha Chain A Phosphoinositide 3-kinases (PI3K) PtdIns-3-kinase p110 | p110 alpha
Type:
Enzyme Subunit
Mol. Mass.:
124294.87
Organism:
Homo sapiens (Human)
Description:
P42336
Residue:
1068
  
Inhibitor
Name:
BDBM244226
Synonyms:
US9428501, 35
Type:
Small organic molecule
Emp. Form.:
C32H35F3N6O2
Mol. Mass.:
592.6545
SMILES:
COc1ccc(CN2CCC(CC2)c2ccc3nc(cn3c2)C(=O)N2CCN(Cc3ccc(cc3)C(F)(F)F)CC2)cn1
: