Target
5'-AMP-activated protein kinase catalytic subunit alpha-2
Ligand
BDBM244234
Substrate
Meas. Tech.
Activation Assay
Temperature
310.15±n/a K
EC50
0.86±n/a nM
Comments
extracted
Citation
 Ohnuki, KAzami, HSawada, YShin, TKuramoto, KKikuchi, SSaito, THamaguchi, HNagashima, T Bicyclic nitrogen-containing aromatic heterocyclic amide compound US Patent  US9428501 Publication Date 8/30/2016 
Target
Name:
5'-AMP-activated protein kinase catalytic subunit alpha-2
Synonyms:
AAPK2_HUMAN AMP-activated protein kinase, alpha-2 subunit AMPK subunit alpha-2 AMPK2 Hydroxymethylglutaryl-CoA reductase kinase | PRKAA2
Type:
Enzyme
Mol. Mass.:
62331.02
Organism:
Homo sapiens (Human)
Description:
P54646
Residue:
552
  
Inhibitor
Name:
BDBM244234
Synonyms:
US9428501, 58
Type:
Small organic molecule
Emp. Form.:
C32H36F3N7O2
Mol. Mass.:
607.6691
SMILES:
CCOc1cnc(CN2CCC(CC2)n2cc3cc(ccc3n2)C(=O)N2CCN(Cc3ccc(cc3)C(F)(F)F)CC2)cn1
: