Target
P2Y purinoceptor 1
Ligand
BDBM245323
Substrate
Meas. Tech.
Scintillation Proximity Assay (SPA)
pH
7.4±n/a
Temperature
298.15±n/a K
Ki
25.8±n/a nM
Comments
extracted
Citation
 Thibeault, CClark, CGDeLucca, IHu, CHJeon, YLam, PYQiao, JXYang, WWang, YWang, TC 7-hydroxy-spiropipiperidine indolinyl antagonists of P2Y1 receptor US Patent  US9428504 Publication Date 8/30/2016 
Target
Name:
P2Y purinoceptor 1
Synonyms:
ATP receptor P2RY1_HUMAN P2Y1 Purinergic receptor P2Y1
Type:
Enzyme
Mol. Mass.:
42090.25
Organism:
Homo sapiens (Human)
Description:
P47900
Residue:
373
  
Inhibitor
Name:
BDBM245323
Synonyms:
US9428504, 66
Type:
Small organic molecule
Emp. Form.:
C30H32ClFN6O2S
Mol. Mass.:
595.13
SMILES:
CC(C)(C)CN1CCC2(CN(c3c2c(Cl)ccc3O)c2ncccc2NC(=O)Nc2nc3ccc(F)cc3s2)CC1
: