Target
P2Y purinoceptor 1
Ligand
BDBM245360
Substrate
Meas. Tech.
Scintillation Proximity Assay (SPA)
pH
7.4±n/a
Temperature
298.15±n/a K
Ki
24.6±n/a nM
Comments
extracted
Citation
 Thibeault, CClark, CGDeLucca, IHu, CHJeon, YLam, PYQiao, JXYang, WWang, YWang, TC 7-hydroxy-spiropipiperidine indolinyl antagonists of P2Y1 receptor US Patent  US9428504 Publication Date 8/30/2016 
Target
Name:
P2Y purinoceptor 1
Synonyms:
ATP receptor P2RY1_HUMAN P2Y1 Purinergic receptor P2Y1
Type:
Enzyme
Mol. Mass.:
42090.25
Organism:
Homo sapiens (Human)
Description:
P47900
Residue:
373
  
Inhibitor
Name:
BDBM245360
Synonyms:
US9428504, 109
Type:
Small organic molecule
Emp. Form.:
C38H35ClF3N7O2S2
Mol. Mass.:
778.308
SMILES:
CC(C)(C)CN1CCC2(CN(c3c2c(ccc3O)-c2nc3cc(ccc3s2)C(F)(F)F)c2ccccc2NC(=O)Nc2nc3ccc(Cl)nc3s2)CC1
: