Target
P2Y purinoceptor 1
Ligand
BDBM245387
Substrate
Meas. Tech.
Scintillation Proximity Assay (SPA)
pH
7.4±n/a
Temperature
298.15±n/a K
Ki
44.7±n/a nM
Comments
extracted
Citation
 Thibeault, CClark, CGDeLucca, IHu, CHJeon, YLam, PYQiao, JXYang, WWang, YWang, TC 7-hydroxy-spiropipiperidine indolinyl antagonists of P2Y1 receptor US Patent  US9428504 Publication Date 8/30/2016 
Target
Name:
P2Y purinoceptor 1
Synonyms:
ATP receptor P2RY1_HUMAN P2Y1 Purinergic receptor P2Y1
Type:
Enzyme
Mol. Mass.:
42090.25
Organism:
Homo sapiens (Human)
Description:
P47900
Residue:
373
  
Inhibitor
Name:
BDBM245387
Synonyms:
US9428504, 137
Type:
Small organic molecule
Emp. Form.:
C38H36ClF4N5O3S
Mol. Mass.:
754.236
SMILES:
CC(C)(C)CN1CCC2(CN(c3c2c(-c2nc4cc(Cl)ccc4s2)c(F)cc3O)c2ccccc2NC(=O)Nc2ccc(OC(F)(F)F)cc2)CC1
: