Target
P2Y purinoceptor 1
Ligand
BDBM245353
Substrate
Meas. Tech.
Scintillation Proximity Assay (SPA)
pH
7.4±n/a
Temperature
298.15±n/a K
Ki
12.6±n/a nM
Comments
extracted
Citation
 Thibeault, CClark, CGDeLucca, IHu, CHJeon, YLam, PYQiao, JXYang, WWang, YWang, TC 7-hydroxy-spiropipiperidine indolinyl antagonists of P2Y1 receptor US Patent  US9428504 Publication Date 8/30/2016 
Target
Name:
P2Y purinoceptor 1
Synonyms:
ATP receptor P2RY1_HUMAN P2Y1 Purinergic receptor P2Y1
Type:
Enzyme
Mol. Mass.:
42090.25
Organism:
Homo sapiens (Human)
Description:
P47900
Residue:
373
  
Inhibitor
Name:
BDBM245353
Synonyms:
US9428504, 102 | US9428504, 179
Type:
Small organic molecule
Emp. Form.:
C30H31ClF2N6O2S
Mol. Mass.:
613.121
SMILES:
CC(C)(C)CN1CCC2(CN(c3c2c(Cl)c(F)cc3O)c2ccccc2NC(=O)Nc2nc3ccc(F)nc3s2)CC1
: