Target
Fatty acid synthase
Ligand
BDBM244605
Substrate
Meas. Tech.
Biochemical Assay
Temperature
277.15±n/a K
IC50
14±n/a nM
Comments
extracted
Citation
 Oslob, JDMcDowell, RSJohnson, RYang, HEvanchik, MZaharia, CACai, HHu, LWWagman, AS Heterocyclic modulators of lipid synthesis US Patent  US9428502 Publication Date 8/30/2016 
Target
Name:
Fatty acid synthase
Synonyms:
FAS FAS_HUMAN HU FASN
Type:
Enzyme
Mol. Mass.:
273419.37
Organism:
Homo sapiens (Human)
Description:
P49327
Residue:
2511
  
Inhibitor
Name:
BDBM244605
Synonyms:
US10226449, cpd 214 | US9428502, 214
Type:
Small organic molecule
Emp. Form.:
C26H23N5O2
Mol. Mass.:
437.4931
SMILES:
Cc1ccc(cc1-c1[nH]c(nc1C#N)C1CCOC1)C(=O)N1CC(C1)c1ccc(cc1)C#N
: